{"text_format":"1","workbook":"xlsx","n_sheets":6,"sheets":["Grain Drying Tool (EMC)","Data","Sheet1","EMC Table, 10 point interval","EMC Table, 5 points interval","EMC Table, 2 points interval"],"not_rendered":{"charts":0,"images":3,"macros":1,"external_links":0,"defined_names":22,"comments":0,"pivot_tables":0},"unopened":[],"bounds":{"document_bytes":16777216,"sheet_cells":100000,"rows_first":2000,"rows_last":500,"rows_between":2000,"halvings":0,"cell_chars":16384,"cell_head_chars":4096},"cells_cut":0,"cells_raw":0,"read":"whole","date_system":"1900"}

{"sheet":"Grain Drying Tool (EMC)","index":0,"n_rows":22,"n_cols":3,"rows_kept":22,"cut":false,"hidden":false,"merged":[[1,1,1,2],[14,1,14,2],[15,1,15,2],[20,0,20,13],[3,1,3,2],[2,1,2,2],[10,1,10,2],[11,1,11,2],[12,1,12,2]]}
[]
[null,"GRAIN DRYING TIPS FOR ARKANSAS FARMERS"]
[null,"Equilibrium Moisture Content"]
[null,"Samy Sadaka, Ph.D. P.E., Email: ssadaka@uaex.edu"]
[null,"Instructions","Value"]
[null,"1 - Enter grain type from drop down list in cell C4","Wheat Durum"]
[null,"2 - Enter air temperature in cell C5, ⁰F",50]
[null,"3 - Enter air relative humidity in cell C6, %",60]
{"$rows_left_out":15}
{"sheet":"Data","index":1,"n_rows":17,"n_cols":1,"rows_kept":17,"cut":false,"hidden":true,"merged":[]}
[]
["GrainType"]
[]
["Corn"]
["Sorghum"]
["Soybeans"]
["Rice Long Grain"]
["Rice Medium Grain"]
{"$rows_left_out":10}
{"sheet":"Sheet1","index":2,"n_rows":49,"n_cols":4,"rows_kept":49,"cut":false,"hidden":true,"merged":[[11,1,13,3],[29,3,31,3]]}
[null,"Item","Value","Instructions/Comments"]
[null,"1 - Enter Grain Type from drop down list",{"$f":"'Grain Drying Tool (EMC)'!C6","v":"Wheat Durum"},"Select grain type from drop down list."]
[null,"2 - Enter Air Temperature (⁰F)",{"$f":"'Grain Drying Tool (EMC)'!C7","v":50},"Select this cell, enter the air temperature measured or expected at plenum, then press \"enter\" key."]
[null,"3 - Enter Air Relative Humidity (%)",{"$f":"'Grain Drying Tool (EMC)'!C8","v":60},"Select this cell, insert relative humidity value (%), then press \"enter\" key."]
[null,"EMC (% Wet basis)",{"$f":"IF(C35=1,EMC(C2,C3,C4),\"\")","v":12.583842133250783},"This is the value of calculated equilibrium moisture content."]
[null,"Will natural air drying occur?                                      Is additional heat needed to reach Target Grain Moisture?",{"$f":"IF(C35=1,IF(C5<=#REF!,C20,(IF(C5<#REF!,C21,C22))),\"\")","v":{"$error":"#REF!"}},{"$f":"IF(C35=1,IF(C5<=#REF!,D20,(IF(C5<#REF!,D21,D22))),\"\")","v":{"$error":"#REF!"}}]
[null,"Air Temperature Increase (⁰F) needed to reach target  moisture content.",{"$f":"IF(AND(C35=1,C36=1),C39,\"\")","v":{"$error":"#REF!"}},"With no change in moisture content this is temperature increase needed that results in EMC equaling the target gain moisture."]
[null,"Air Temperature (⁰F) after change",{"$f":"IF(AND(C35=1,C36=1),C3+C7,\"\")","v":{"$error":"#REF!"}},"This is the air temperature needed to reach the target moisture content."]
{"$rows_left_out":42}
{"sheet":"EMC Table, 10 point interval","index":3,"n_rows":14,"n_cols":10,"rows_kept":14,"cut":false,"hidden":false,"merged":[[3,2,3,9],[0,0,0,9],[13,1,13,9],[5,0,12,0],[1,0,1,9],[2,0,2,9]]}
[]
["GRAIN DRYING TIPS FOR ARKANSAS FARMERS "]
[{"$f":"'Grain Drying Tool (EMC)'!C6&\" Equilibrium Moisture Content Table\"","v":"Wheat Durum Equilibrium Moisture Content Table"}]
[null,null,"Relative Humidity (%)"]
[null,null,20,30,40,50,60,70,80,90]
["Temperature (oF)",30,{"$f":"EMC('Grain Drying Tool (EMC)'!$C$6,$B6,C$5)","v":7.6539100536291151},{"$f":"EMC('Grain Drying Tool (EMC)'!$C$6,$B6,D$5)","v":9.0250237896773076},{"$f":"EMC('Grain Drying Tool (EMC)'!$C$6,$B6,E$5)","v":10.310028410058537},{"$f":"EMC('Grain Drying Tool (EMC)'!$C$6,$B6,F$5)","v":11.629139784496465},{"$f":"EMC('Grain Drying Tool (EMC)'!$C$6,$B6,G$5)","v":13.092387752023395},{"$f":"EMC('Grain Drying Tool (EMC)'!$C$6,$B6,H$5)","v":14.861906735557442},{"$f":"EMC('Grain Drying Tool (EMC)'!$C$6,$B6,I$5)","v":17.282599034429946},{"$f":"EMC('Grain Drying Tool (EMC)'!$C$6,$B6,J$5)","v":21.49566474788362}]
[null,40,{"$f":"EMC('Grain Drying Tool (EMC)'!$C$6,$B7,C$5)","v":7.496609462952553},{"$f":"EMC('Grain Drying Tool (EMC)'!$C$6,$B7,D$5)","v":8.8422426691540323},{"$f":"EMC('Grain Drying Tool (EMC)'!$C$6,$B7,E$5)","v":10.104112913110791},{"$f":"EMC('Grain Drying Tool (EMC)'!$C$6,$B7,F$5)","v":11.400227264323719},{"$f":"EMC('Grain Drying Tool (EMC)'!$C$6,$B7,G$5)","v":12.838856719407415},{"$f":"EMC('Grain Drying Tool (EMC)'!$C$6,$B7,H$5)","v":14.579857992507989},{"$f":"EMC('Grain Drying Tool (EMC)'!$C$6,$B7,I$5)","v":16.963763985315573},{"$f":"EMC('Grain Drying Tool (EMC)'!$C$6,$B7,J$5)","v":21.118949748637917}]
[null,50,{"$f":"EMC('Grain Drying Tool (EMC)'!$C$6,$B8,C$5)","v":7.3387720721726355},{"$f":"EMC('Grain Drying Tool (EMC)'!$C$6,$B8,D$5)","v":8.6587256056791233},{"$f":"EMC('Grain Drying Tool (EMC)'!$C$6,$B8,E$5)","v":9.897249734671286},{"$f":"EMC('Grain Drying Tool (EMC)'!$C$6,$B8,F$5)","v":11.170125731580637},{"$f":"EMC('Grain Drying Tool (EMC)'!$C$6,$B8,G$5)","v":12.583842133250783},{"$f":"EMC('Grain Drying Tool (EMC)'!$C$6,$B8,H$5)","v":14.295934274165864},{"$f":"EMC('Grain Drying Tool (EMC)'!$C$6,$B8,I$5)","v":16.642461519750118},{"$f":"EMC('Grain Drying Tool (EMC)'!$C$6,$B8,J$5)","v":20.73860186795547}]
{"$rows_left_out":7}
{"sheet":"EMC Table, 5 points interval","index":4,"n_rows":68,"n_cols":17,"rows_kept":68,"cut":false,"hidden":false,"merged":[[20,7,20,16],[5,0,19,0],[2,0,2,16],[0,0,0,16],[1,0,1,16],[3,2,3,16]]}
[]
["GRAIN DRYING TIPS FOR ARKANSAS FARMERS "]
[{"$f":"'Grain Drying Tool (EMC)'!C6&\" Equilibrium Moisture Content Table\"","v":"Wheat Durum Equilibrium Moisture Content Table"}]
[null,null,"Relative Humidity (%)"]
[null,null,20,25,30,35,40,45,50,55,60,65,70,75,80,85,90]
["Temperature (oF)",30,{"$f":"EMC('Grain Drying Tool (EMC)'!$C$6,$B6,C$5)","v":7.6539100536291151},{"$f":"EMC('Grain Drying Tool (EMC)'!$C$6,$B6,D$5)","v":8.3601401676636744},{"$f":"EMC('Grain Drying Tool (EMC)'!$C$6,$B6,E$5)","v":9.0250237896773076},{"$f":"EMC('Grain Drying Tool (EMC)'!$C$6,$B6,F$5)","v":9.669800690387893},{"$f":"EMC('Grain Drying Tool (EMC)'!$C$6,$B6,G$5)","v":10.310028410058537},{"$f":"EMC('Grain Drying Tool (EMC)'!$C$6,$B6,H$5)","v":10.95888671030592},{"$f":"EMC('Grain Drying Tool (EMC)'!$C$6,$B6,I$5)","v":11.629139784496465},{"$f":"EMC('Grain Drying Tool (EMC)'!$C$6,$B6,J$5)","v":12.334707292299596},{"$f":"EMC('Grain Drying Tool (EMC)'!$C$6,$B6,K$5)","v":13.092387752023395},{"$f":"EMC('Grain Drying Tool (EMC)'!$C$6,$B6,L$5)","v":13.924290454436026},{"$f":"EMC('Grain Drying Tool (EMC)'!$C$6,$B6,M$5)","v":14.861906735557442},{"$f":"EMC('Grain Drying Tool (EMC)'!$C$6,$B6,N$5)","v":15.953855975244405},{"$f":"EMC('Grain Drying Tool (EMC)'!$C$6,$B6,O$5)","v":17.282599034429946},{"$f":"EMC('Grain Drying Tool (EMC)'!$C$6,$B6,P$5)","v":19.00666335214002},{"$f":"EMC('Grain Drying Tool (EMC)'!$C$6,$B6,Q$5)","v":21.49566474788362}]
[null,35,{"$f":"EMC('Grain Drying Tool (EMC)'!$C$6,$B7,C$5)","v":7.5753266870042992},{"$f":"EMC('Grain Drying Tool (EMC)'!$C$6,$B7,D$5)","v":8.2749556160375111},{"$f":"EMC('Grain Drying Tool (EMC)'!$C$6,$B7,E$5)","v":8.9337249453235419},{"$f":"EMC('Grain Drying Tool (EMC)'!$C$6,$B7,F$5)","v":9.5726654980561605},{"$f":"EMC('Grain Drying Tool (EMC)'!$C$6,$B7,G$5)","v":10.207188714287129},{"$f":"EMC('Grain Drying Tool (EMC)'!$C$6,$B7,H$5)","v":10.850357812098087},{"$f":"EMC('Grain Drying Tool (EMC)'!$C$6,$B7,I$5)","v":11.514831574233439},{"$f":"EMC('Grain Drying Tool (EMC)'!$C$6,$B7,J$5)","v":12.21442232024773},{"$f":"EMC('Grain Drying Tool (EMC)'!$C$6,$B7,K$5)","v":12.965806869609938},{"$f":"EMC('Grain Drying Tool (EMC)'!$C$6,$B7,L$5)","v":13.790942818195594},{"$f":"EMC('Grain Drying Tool (EMC)'!$C$6,$B7,M$5)","v":14.721115573215867},{"$f":"EMC('Grain Drying Tool (EMC)'!$C$6,$B7,N$5)","v":15.804640737989056},{"$f":"EMC('Grain Drying Tool (EMC)'!$C$6,$B7,O$5)","v":17.123488157106557},{"$f":"EMC('Grain Drying Tool (EMC)'!$C$6,$B7,P$5)","v":18.835294276891492},{"$f":"EMC('Grain Drying Tool (EMC)'!$C$6,$B7,Q$5)","v":21.307758097589005}]
[null,40,{"$f":"EMC('Grain Drying Tool (EMC)'!$C$6,$B8,C$5)","v":7.496609462952553},{"$f":"EMC('Grain Drying Tool (EMC)'!$C$6,$B8,D$5)","v":8.1896125491238774},{"$f":"EMC('Grain Drying Tool (EMC)'!$C$6,$B8,E$5)","v":8.8422426691540323},{"$f":"EMC('Grain Drying Tool (EMC)'!$C$6,$B8,F$5)","v":9.4753211751649911},{"$f":"EMC('Grain Drying Tool (EMC)'!$C$6,$B8,G$5)","v":10.104112913110791},{"$f":"EMC('Grain Drying Tool (EMC)'!$C$6,$B8,H$5)","v":10.741564027362399},{"$f":"EMC('Grain Drying Tool (EMC)'!$C$6,$B8,I$5)","v":11.400227264323719},{"$f":"EMC('Grain Drying Tool (EMC)'!$C$6,$B8,J$5)","v":12.093806810227434},{"$f":"EMC('Grain Drying Tool (EMC)'!$C$6,$B8,K$5)","v":12.838856719407415},{"$f":"EMC('Grain Drying Tool (EMC)'!$C$6,$B8,L$5)","v":13.65718137922282},{"$f":"EMC('Grain Drying Tool (EMC)'!$C$6,$B8,M$5)","v":14.579857992507989},{"$f":"EMC('Grain Drying Tool (EMC)'!$C$6,$B8,N$5)","v":15.654894725952056},{"$f":"EMC('Grain Drying Tool (EMC)'!$C$6,$B8,O$5)","v":16.963763985315573},{"$f":"EMC('Grain Drying Tool (EMC)'!$C$6,$B8,P$5)","v":18.663198484369591},{"$f":"EMC('Grain Drying Tool (EMC)'!$C$6,$B8,Q$5)","v":21.118949748637917}]
{"$rows_left_out":61}
{"sheet":"EMC Table, 2 points interval","index":5,"n_rows":42,"n_cols":39,"rows_kept":42,"cut":false,"hidden":false,"merged":[[0,0,0,37],[41,22,41,37],[5,0,40,0],[3,2,3,37],[1,0,1,37],[2,0,2,37]]}
[]
["GRAIN DRYING TIPS FOR ARKANSAS FARMERS "]
[{"$f":"'Grain Drying Tool (EMC)'!C6&\" Equilibrium Moisture Content Table\"","v":"Wheat Durum Equilibrium Moisture Content Table"}]
[null,null,"Relative Humidity (%)"]
[null,null,20,22,24,26,28,30,32,34,36,38,40,42,44,46,48,50,52,54,56,58,60,62,64,66,68,70,72,74,76,78,80,82,84,86,88,90]
["Temperature (oF)",30,{"$f":"EMC('Grain Drying Tool (EMC)'!$C$6,$B6,C$5)","v":7.6539100536291151},{"$f":"EMC('Grain Drying Tool (EMC)'!$C$6,$B6,D$5)","v":7.9431238878756387},{"$f":"EMC('Grain Drying Tool (EMC)'!$C$6,$B6,E$5)","v":8.2230397022909294},{"$f":"EMC('Grain Drying Tool (EMC)'!$C$6,$B6,F$5)","v":8.4956237886563617},{"$f":"EMC('Grain Drying Tool (EMC)'!$C$6,$B6,G$5)","v":8.7624955678052068},{"$f":"EMC('Grain Drying Tool (EMC)'!$C$6,$B6,H$5)","v":9.0250237896773076},{"$f":"EMC('Grain Drying Tool (EMC)'!$C$6,$B6,I$5)","v":9.2843940335399786},{"$f":"EMC('Grain Drying Tool (EMC)'!$C$6,$B6,J$5)","v":9.5416577074401356},{"$f":"EMC('Grain Drying Tool (EMC)'!$C$6,$B6,K$5)","v":9.7977688263293974},{"$f":"EMC('Grain Drying Tool (EMC)'!$C$6,$B6,L$5)","v":10.053612587089598},{"$f":"EMC('Grain Drying Tool (EMC)'!$C$6,$B6,M$5)","v":10.310028410058537},{"$f":"EMC('Grain Drying Tool (EMC)'!$C$6,$B6,N$5)","v":10.567829292255055},{"$f":"EMC('Grain Drying Tool (EMC)'!$C$6,$B6,O$5)","v":10.827818806963943},{"$f":"EMC('Grain Drying Tool (EMC)'!$C$6,$B6,P$5)","v":11.090806770216968},{"$f":"EMC('Grain Drying Tool (EMC)'!$C$6,$B6,Q$5)","v":11.357624410324664},{"$f":"EMC('Grain Drying Tool (EMC)'!$C$6,$B6,R$5)","v":11.629139784496465},{"$f":"EMC('Grain Drying Tool (EMC)'!$C$6,$B6,S$5)","v":11.906274167228409},{"$f":"EMC('Grain Drying Tool (EMC)'!$C$6,$B6,T$5)","v":12.190020181347769},{"$f":"EMC('Grain Drying Tool (EMC)'!$C$6,$B6,U$5)","v":12.481462557135277},{"$f":"EMC('Grain Drying Tool (EMC)'!$C$6,$B6,V$5)","v":12.781802600458185},{"$f":"EMC('Grain Drying Tool (EMC)'!$C$6,$B6,W$5)","v":13.092387752023395},{"$f":"EMC('Grain Drying Tool (EMC)'!$C$6,$B6,X$5)","v":13.414748068185007},{"$f":"EMC('Grain Drying Tool (EMC)'!$C$6,$B6,Y$5)","v":13.75064211626488},{"$f":"EMC('Grain Drying Tool (EMC)'!$C$6,$B6,Z$5)","v":14.10211576210013},{"$f":"EMC('Grain Drying Tool (EMC)'!$C$6,$B6,AA$5)","v":14.471578810695101},{"$f":"EMC('Grain Drying Tool (EMC)'!$C$6,$B6,AB$5)","v":14.861906735557442},{"$f":"EMC('Grain Drying Tool (EMC)'!$C$6,$B6,AC$5)","v":15.276578298699697},{"$f":"EMC('Grain Drying Tool (EMC)'!$C$6,$B6,AD$5)","v":15.719865600314732},{"$f":"EMC('Grain Drying Tool (EMC)'!$C$6,$B6,AE$5)","v":16.197102602284055},{"$f":"EMC('Grain Drying Tool (EMC)'!$C$6,$B6,AF$5)","v":16.715074460468387},{"$f":"EMC('Grain Drying Tool (EMC)'!$C$6,$B6,AG$5)","v":17.282599034429946},{"$f":"EMC('Grain Drying Tool (EMC)'!$C$6,$B6,AH$5)","v":17.911426098450793},{"$f":"EMC('Grain Drying Tool (EMC)'!$C$6,$B6,AI$5)","v":18.617686367244612},{"$f":"EMC('Grain Drying Tool (EMC)'!$C$6,$B6,AJ$5)","v":19.424346206775486},{"$f":"EMC('Grain Drying Tool (EMC)'!$C$6,$B6,AK$5)","v":20.36563218678118},{"$f":"EMC('Grain Drying Tool (EMC)'!$C$6,$B6,AL$5)","v":21.49566474788362}]
[null,32,{"$f":"EMC('Grain Drying Tool (EMC)'!$C$6,$B7,C$5)","v":7.6224927480112274},{"$f":"EMC('Grain Drying Tool (EMC)'!$C$6,$B7,D$5)","v":7.9106211291830588},{"$f":"EMC('Grain Drying Tool (EMC)'!$C$6,$B7,E$5)","v":8.1894934418541769},{"$f":"EMC('Grain Drying Tool (EMC)'!$C$6,$B7,F$5)","v":8.4610680280290609},{"$f":"EMC('Grain Drying Tool (EMC)'!$C$6,$B7,G$5)","v":8.7269578380178228},{"$f":"EMC('Grain Drying Tool (EMC)'!$C$6,$B7,H$5)","v":8.9885262284306737},{"$f":"EMC('Grain Drying Tool (EMC)'!$C$6,$B7,I$5)","v":9.2469541820841332},{"$f":"EMC('Grain Drying Tool (EMC)'!$C$6,$B7,J$5)","v":9.503289105795572},{"$f":"EMC('Grain Drying Tool (EMC)'!$C$6,$B7,K$5)","v":9.7584814590700688},{"$f":"EMC('Grain Drying Tool (EMC)'!$C$6,$B7,L$5)","v":10.013413215080021},{"$f":"EMC('Grain Drying Tool (EMC)'!$C$6,$B7,M$5)","v":10.268920812455763},{"$f":"EMC('Grain Drying Tool (EMC)'!$C$6,$B7,N$5)","v":10.525814435538381},{"$f":"EMC('Grain Drying Tool (EMC)'!$C$6,$B7,O$5)","v":10.784894952425399},{"$f":"EMC('Grain Drying Tool (EMC)'!$C$6,$B7,P$5)","v":11.046969527421817},{"$f":"EMC('Grain Drying Tool (EMC)'!$C$6,$B7,Q$5)","v":11.312866741010637},{"$f":"EMC('Grain Drying Tool (EMC)'!$C$6,$B7,R$5)","v":11.583451958868624},{"$f":"EMC('Grain Drying Tool (EMC)'!$C$6,$B7,S$5)","v":11.859643672365657},{"$f":"EMC('Grain Drying Tool (EMC)'!$C$6,$B7,T$5)","v":12.14243157925914},{"$f":"EMC('Grain Drying Tool (EMC)'!$C$6,$B7,U$5)","v":12.432897287699383},{"$f":"EMC('Grain Drying Tool (EMC)'!$C$6,$B7,V$5)","v":12.732238721847439},{"$f":"EMC('Grain Drying Tool (EMC)'!$C$6,$B7,W$5)","v":13.041799608017911},{"$f":"EMC('Grain Drying Tool (EMC)'!$C$6,$B7,X$5)","v":13.363105867706993},{"$f":"EMC('Grain Drying Tool (EMC)'!$C$6,$B7,Y$5)","v":13.697911405077992},{"$f":"EMC('Grain Drying Tool (EMC)'!$C$6,$B7,Z$5)","v":14.048256759282763},{"$f":"EMC('Grain Drying Tool (EMC)'!$C$6,$B7,AA$5)","v":14.416545572251458},{"$f":"EMC('Grain Drying Tool (EMC)'!$C$6,$B7,AB$5)","v":14.80564609288067},{"$f":"EMC('Grain Drying Tool (EMC)'!$C$6,$B7,AC$5)","v":15.219028498159151},{"$f":"EMC('Grain Drying Tool (EMC)'!$C$6,$B7,AD$5)","v":15.660954538076412},{"$f":"EMC('Grain Drying Tool (EMC)'!$C$6,$B7,AE$5)","v":16.136745498927333},{"$f":"EMC('Grain Drying Tool (EMC)'!$C$6,$B7,AF$5)","v":16.653170741336538},{"$f":"EMC('Grain Drying Tool (EMC)'!$C$6,$B7,AG$5)","v":17.219028052595178},{"$f":"EMC('Grain Drying Tool (EMC)'!$C$6,$B7,AH$5)","v":17.846041116913604},{"$f":"EMC('Grain Drying Tool (EMC)'!$C$6,$B7,AI$5)","v":18.550305823469877},{"$f":"EMC('Grain Drying Tool (EMC)'!$C$6,$B7,AJ$5)","v":19.354740540148185},{"$f":"EMC('Grain Drying Tool (EMC)'!$C$6,$B7,AK$5)","v":20.293503012199078},{"$f":"EMC('Grain Drying Tool (EMC)'!$C$6,$B7,AL$5)","v":21.420609877807017}]
[null,34,{"$f":"EMC('Grain Drying Tool (EMC)'!$C$6,$B8,C$5)","v":7.5910540579901014},{"$f":"EMC('Grain Drying Tool (EMC)'!$C$6,$B8,D$5)","v":7.8780954107183216},{"$f":"EMC('Grain Drying Tool (EMC)'!$C$6,$B8,E$5)","v":8.1559226488315986},{"$f":"EMC('Grain Drying Tool (EMC)'!$C$6,$B8,F$5)","v":8.4264861582307429},{"$f":"EMC('Grain Drying Tool (EMC)'!$C$6,$B8,G$5)","v":8.6913924129891136},{"$f":"EMC('Grain Drying Tool (EMC)'!$C$6,$B8,H$5)","v":8.951999371070956},{"$f":"EMC('Grain Drying Tool (EMC)'!$C$6,$B8,I$5)","v":9.2094834137596102},{"$f":"EMC('Grain Drying Tool (EMC)'!$C$6,$B8,J$5)","v":9.4648879416643794},{"$f":"EMC('Grain Drying Tool (EMC)'!$C$6,$B8,K$5)","v":9.7191598538597397},{"$f":"EMC('Grain Drying Tool (EMC)'!$C$6,$B8,L$5)","v":9.973177894721502},{"$f":"EMC('Grain Drying Tool (EMC)'!$C$6,$B8,M$5)","v":10.227775515890496},{"$f":"EMC('Grain Drying Tool (EMC)'!$C$6,$B8,N$5)","v":10.483760083461886},{"$f":"EMC('Grain Drying Tool (EMC)'!$C$6,$B8,O$5)","v":10.741929754396658},{"$f":"EMC('Grain Drying Tool (EMC)'!$C$6,$B8,P$5)","v":11.003089034839737},{"$f":"EMC('Grain Drying Tool (EMC)'!$C$6,$B8,Q$5)","v":11.268063850413927},{"$f":"EMC('Grain Drying Tool (EMC)'!$C$6,$B8,R$5)","v":11.537716867498656},{"$f":"EMC('Grain Drying Tool (EMC)'!$C$6,$B8,S$5)","v":11.812963785684971},{"$f":"EMC('Grain Drying Tool (EMC)'!$C$6,$B8,T$5)","v":12.094791367932949},{"$f":"EMC('Grain Drying Tool (EMC)'!$C$6,$B8,U$5)","v":12.384278089233064},{"$f":"EMC('Grain Drying Tool (EMC)'!$C$6,$B8,V$5)","v":12.682618479428665},{"$f":"EMC('Grain Drying Tool (EMC)'!$C$6,$B8,W$5)","v":12.991152535898312},{"$f":"EMC('Grain Drying Tool (EMC)'!$C$6,$B8,X$5)","v":13.311402028361064},{"$f":"EMC('Grain Drying Tool (EMC)'!$C$6,$B8,Y$5)","v":13.645116177958322},{"$f":"EMC('Grain Drying Tool (EMC)'!$C$6,$B8,Z$5)","v":13.994330173609706},{"$f":"EMC('Grain Drying Tool (EMC)'!$C$6,$B8,AA$5)","v":14.361441465964468},{"$f":"EMC('Grain Drying Tool (EMC)'!$C$6,$B8,AB$5)","v":14.749311045132522},{"$f":"EMC('Grain Drying Tool (EMC)'!$C$6,$B8,AC$5)","v":15.161400461146981},{"$f":"EMC('Grain Drying Tool (EMC)'!$C$6,$B8,AD$5)","v":15.601961061617153},{"$f":"EMC('Grain Drying Tool (EMC)'!$C$6,$B8,AE$5)","v":16.076301391285501},{"$f":"EMC('Grain Drying Tool (EMC)'!$C$6,$B8,AF$5)","v":16.591174930608915},{"$f":"EMC('Grain Drying Tool (EMC)'!$C$6,$B8,AG$5)","v":17.155359282920877},{"$f":"EMC('Grain Drying Tool (EMC)'!$C$6,$B8,AH$5)","v":17.780551891787088},{"$f":"EMC('Grain Drying Tool (EMC)'!$C$6,$B8,AI$5)","v":18.482813611702394},{"$f":"EMC('Grain Drying Tool (EMC)'!$C$6,$B8,AJ$5)","v":19.285014511164526},{"$f":"EMC('Grain Drying Tool (EMC)'!$C$6,$B8,AK$5)","v":20.221243056535027},{"$f":"EMC('Grain Drying Tool (EMC)'!$C$6,$B8,AL$5)","v":21.34541135644368}]
{"$rows_left_out":34}